{"text_format":"1","workbook":"xlsx","n_sheets":4,"sheets":["Calculator","1. Plan Inputs","2. Contribution Inputs","Worksheet"],"not_rendered":{"charts":1,"images":1,"macros":1,"external_links":0,"defined_names":27,"comments":1,"pivot_tables":0},"unopened":[],"bounds":{"document_bytes":16777216,"sheet_cells":100000,"rows_first":2000,"rows_last":500,"rows_between":2000,"halvings":0,"cell_chars":16384,"cell_head_chars":4096},"cells_cut":0,"cells_raw":0,"read":"whole","date_system":"1900"}

{"sheet":"Calculator","index":0,"n_rows":82,"n_cols":9,"rows_kept":82,"cut":false,"hidden":false,"merged":[[81,0,81,7],[1,0,1,7],[3,0,3,7],[56,0,56,7],[48,0,50,0],[51,0,54,0],[18,0,18,7],[10,0,10,7],[30,0,37,0],[27,0,29,0],[2,0,2,7],[71,0,76,0]]}
[]
["KrolLDiscovery Employee Plan Costs Calculator"]
["Note:  Healthcare costs are unpredictable; this comparison sheet provides only a general estimate of healthcare costs, based on average procedure cost.  Your actual cost will be different.  The calculator assumes all claims are in-network."]
["Instructions"]
["     - Select coverage type and contribution band from the drop down menus."]
["     - Input HSA rollover amount if applicable."]
["     - Enter the applicable information for you and your covered dependents in the light blue cells.  Delete any inputs in cells that are not light blue."]
["     - If you do not want to enter data, either leave it blank or 0.  Do not enter a space.  Clear the calculator by clicking the button before re-entering data."]
["     - Click the \"Low\", \"Med\", or \"High\" buttons to input default utilization assumptions."]
["     - Use the outputs to determine which plans are most cost effective."]
["Type of Coverage"]
[]
["   Coverage Type","Employee",null,null,{"$f":"IF(B15=\"\",\"Warning: Select a\"&\" \"& A15,\"\")","v":""},null,null,{"$f":"B13=\"Employee\"","v":true}]
[null,null,null,null,null,null,null,{"$f":"B13=\"Employee + Spouse\"","v":false}]
[{"$f":"'2. Contribution Inputs'!D17","v":"Contribution Band"},"Active",null,null,null,null,null,{"$f":"B13=\"Employee + 1\"","v":false}]
[null,null,null,null,null,null,null,{"$f":"B13=\"Employee + Child\"","v":false}]
["   Health Savings Account (HSA) Rollover from Prior Years",0,null,null,{"$f":"IF(OR(AND(D21=\"\",SUM(D22:D38)<>0),AND(E21=\"\",SUM(E22:E38)<>0),AND(F21=\"\",SUM(F22:F38)<>0),AND(G21=\"\",SUM(G22:G38)<>0),AND(H21=\"\",SUM(H22:H38)<>0),AND(I21=\"\",SUM(I22:I38)<>0)),\"Warning: Clear the gray utilization inputs below\",\"\")","v":""},null,null,{"$f":"B13=\"Employee + Child(ren)\"","v":false}]
[null,null,null,null,null,null,null,{"$f":"B13=\"Employee + Family\"","v":false}]
["Are you (and other dependent plan participants) Low, Medium, or High Utilizers of the Medical Plan?"]
["You can enter the estimated number of visits below or have the tool generalize for you to the right --->"]
[null,null,{"$f":"'2. Contribution Inputs'!C10","v":"Employee"},{"$f":"IF(VLOOKUP(Coverage,Worksheet!$E$1:$K$14,3,FALSE)=0,\"\",(VLOOKUP(Coverage,Worksheet!$E$1:$K$14,3,FALSE)))","v":""},{"$f":"IF(VLOOKUP(Coverage,Worksheet!$E$1:$K$14,4,FALSE)=0,\"\",(VLOOKUP(Coverage,Worksheet!$E$1:$K$14,4,FALSE)))","v":""},{"$f":"IF(VLOOKUP(Coverage,Worksheet!$E$1:$K$14,5,FALSE)=0,\"\",(VLOOKUP(Coverage,Worksheet!$E$1:$K$14,5,FALSE)))","v":""},{"$f":"IF(VLOOKUP(Coverage,Worksheet!$E$1:$K$14,6,FALSE)=0,\"\",(VLOOKUP(Coverage,Worksheet!$E$1:$K$14,6,FALSE)))","v":""},{"$f":"IF(VLOOKUP(Coverage,Worksheet!$E$1:$K$14,7,FALSE)=0,\"\",(VLOOKUP(Coverage,Worksheet!$E$1:$K$14,7,FALSE)))","v":""}]
["Preventive Services","Annual number of Covered Preventive Visits"]
["Hospitalizations","Annual number of Days in Hospitals"]
["Outpatient Surgery","Annual number of Outpatient Surgeries"]
["Lab/X-ray/other Radiology Performed in Hospital/Outpatient Facility","Annual number of Lab/Radiology Procedures (performed in the hospital or outpatient facility)"]
["Emergency Room Visits","Annual number of Emergency Room Visits"]
["Urgent Care Visits","Annual number of Urgent Care Visits"]
["Office Visits","Annual number of Primary Care Office Visits "]
[null,"Annual number of Specialists Office Visits "]
[null,"Annual number of Chiropractor Visits"]
{"$rows_left_out":53}
{"sheet":"1. Plan Inputs","index":1,"n_rows":61,"n_cols":22,"rows_kept":61,"cut":false,"hidden":true,"merged":[[0,0,0,6]]}
["Instructions"]
["Only light blue boxes should be used to input information."]
[]
["1.  Select the number of plans and input unique names for each plan."]
[]
["2.  Input the benefit design for each plan.  If the inputs do not accommodate your plan please contact"]
["LBG actuarial."]
[]
["3.  To reset a plan to the default settings click the \"Reset Defaults\" buttons.  Click the \"Reset Defaults\""]
["button for unused plan slots."]
[]
["4.  Move to the \"2. Contribution Inputs\" tab when finished."]
[]
["Number of unique plans:",null,null,null,3]
[null,"Reselecting might clear plan designs"]
[]
["Plan Name:",null,null,null,null,"OAP",null,null,"HSA 1350",null,null,"HSA 2000"]
[]
[null,"Does the plan have an HSA or HRA?",null,null,null,null,"No",null,"HSA/HRA?","Yes",null,"HSA/HRA?","Yes",null,"HSA/HRA?","No",null,"HSA/HRA?","No",null,"HSA/HRA?","No"]
[]
["Input Benefits:"]
[]
[null,"Individual Deductible:",null,null,null,null,250,null,"Ind. Ded.:",1350,null,"Ind. Ded.:",2000,null,"Ind. Ded.:",0,null,"Ind. Ded.:",0,null,"Ind. Ded.:",0]
[null,"Family Deductible:",null,null,null,null,500,null,"Fam. Ded.:",2700,null,"Fam. Ded.:",4000,null,"Fam. Ded.:",0,null,"Fam. Ded.:",0,null,"Fam. Ded.:",0]
[]
[null,null,"Embedded/Non-Embedded:",null,null,null,"Embedded",null,"Emb/Non-Emb:","Non-Embedded",null,"Emb/Non-Emb:","Non-Embedded",null,null,"Embedded",null,"Emb/Non-Emb:","Embedded",null,"Emb/Non-Emb:","Embedded"]
[null,null,null,"Applies to Deductible and Out-of-Pocket Max"]
[null,"Member Coinsurance:",null,null,null,null,0.1,null,"Coinsurance:",0.2,null,"Coinsurance:",0.2,null,"Coinsurance:",0,null,"Coinsurance:",0,null,"Coinsurance:",0]
[]
[null,"Individual Out-of-Pocket Max:",null,null,null,null,2500,null,"Ind. OOP Max:",2700,null,"Ind. OOP Max:",6000,null,"Ind. OOP Max:",0,null,"Ind. OOP Max:",0,null,"Ind. OOP Max:",0]
{"$rows_left_out":32}
{"sheet":"2. Contribution Inputs","index":2,"n_rows":143,"n_cols":14,"rows_kept":143,"cut":false,"hidden":true,"merged":[[0,5,0,8],[19,5,20,5],[22,5,23,5],[25,5,26,5],[19,8,23,8]]}
[null,null,null,null,null,"Instructions"]
[null,null,null,null,null,"Only light blue boxes should be used to input information."]
[]
[null,null,null,null,null,"1.  Go to the \"Tier Description\" box and select the appropriate tier structure."]
[]
[null,null,null,null,null,"2.  Go to the \"Contribution Band\" box and list all contribution bands.  Enter all possible bands"]
[null,null,null,null,null,"even if certain bands do not apply to every plan.  YOU MUST ENTER AT LEAST ONE CONTRIBUTION"]
[null,"1. Tier Description:",null,null,null,"BAND NAME.  In the top right, input the label that will appear on the calculator tab."]
[null,null,null,"Sample"]
[null,"Tier 1:","Employee","Employee",null,"3.  Go to the \"Monthly Employee Contributions\" box and enter the contribution amounts for the"]
[null,"Tier 2:","Employee + Spouse","Employee + Spouse",null,"appropriate plan, tier, and band."]
[null,"Tier 3:","Employee + Child(ren)","Employee + Child(ren)"]
[null,"Tier 4:","Employee + Family","Employee + Family",null,"4.  If one or more of the plans has an HSA then continue to the \"Monthly Employer HSA."]
[null,"Tier 5:",null,null,null,"Contributions\" box.  Enter the monthly HSA amounts for the appropriate plan, tier, and band."]
[null,"Tier 6:"]
[null,null,null,null,null,"5.  Use the buttons below to select which features will be visible on the \"Calculator\" tab."]
[null,"2. Contribution Bands:",null,"Contribution Band"]
[null,null,null,"Sample",null,"6.  Click the \"Lock\" button to lock the calculator for client use.  The password to unlock is \"calculator\"."]
[null,"Band 1:","Active","<=$75k"]
[null,"Band 2:",null,"$75k - $125k",null,"Low/Med/High Inputs:",null,null,"The Low/Med/High Inputs and Utilization Inputs should not be hidden simultaneously."]
[null,"Band 3:",null,"$125k+"]
[null,"Band 4:",null,"<=$75k, Tobacco"]
[null,"Band 5:",null,"$75k - $125k Tobacco",null,"Utilization Inputs:"]
[null,"Band 6:",null,"$125k+ Tobacco"]
[null,"Band 7:"]
[null,"Band 8:",null,null,null,"Costs per Service"]
[null,"Band 9:"]
[null,"Band 10:"]
[null,"Band 11:"]
[null,"Band 12:"]
{"$rows_left_out":114}
{"sheet":"Worksheet","index":3,"n_rows":218,"n_cols":47,"rows_kept":218,"cut":false,"hidden":true,"merged":[[17,41,17,46],[17,1,17,6],[17,9,17,14],[17,17,17,22],[17,25,17,30],[17,33,17,38]]}
[null,1,"Yes","Embedded","Employee","Copayments",null,null,null,null,null,"Adjusteable Headers for Utilization Table"]
[null,2,"No","Non-Embedded","Employee + Spouse","Coinsurance","Spouse"]
[null,3,null,null,"Employee + 1",null,"Dependent"]
[null,4,null,null,"Employee + Child",null,"Child"]
[null,5,null,null,"Employee + Child(ren)",null,"Child","Child","Child","Child","Child"]
[null,6,null,null,"Employee + Family",null,"Spouse","Child","Child","Child","Child"]
[null,null,null,null,"Employee + Children",null,"Child","Child","Child","Child","Child"]
[null,null,null,null,"Associate"]
[null,null,null,null,"Associate + Spouse",null,"Spouse"]
[null,null,null,null,"Associate + 1",null,"Dependent"]
[null,null,null,null,"Associate + Child",null,"Child"]
[null,null,null,null,"Associate + Child(ren)",null,"Child","Child","Child","Child","Child"]
[null,null,null,null,"Associate + Family",null,"Spouse","Child","Child","Child","Child"]
[null,null,null,null,"Associate + Children",null,"Child","Child","Child","Child","Child"]
[]
[]
[null,{"$f":"Calculator!$C$21","v":"Employee"},{"$f":"Calculator!D21","v":""},{"$f":"Calculator!E21","v":""},{"$f":"Calculator!F21","v":""},{"$f":"Calculator!G21","v":""},{"$f":"Calculator!H21","v":""},null,null,{"$f":"Calculator!C21","v":"Employee"},{"$f":"Calculator!D21","v":""},{"$f":"Calculator!E21","v":""},{"$f":"Calculator!F21","v":""},{"$f":"Calculator!G21","v":""},{"$f":"Calculator!H21","v":""},null,null,{"$f":"Calculator!C21","v":"Employee"},{"$f":"Calculator!D21","v":""},{"$f":"Calculator!E21","v":""},{"$f":"Calculator!F21","v":""},{"$f":"Calculator!G21","v":""},{"$f":"Calculator!H21","v":""},null,null,{"$f":"Calculator!C21","v":"Employee"},{"$f":"Calculator!D21","v":""},{"$f":"Calculator!E21","v":""},{"$f":"Calculator!F21","v":""},{"$f":"Calculator!G21","v":""},{"$f":"Calculator!H21","v":""},null,null,{"$f":"Calculator!C21","v":"Employee"},{"$f":"Calculator!D21","v":""},{"$f":"Calculator!E21","v":""},{"$f":"Calculator!F21","v":""},{"$f":"Calculator!G21","v":""},{"$f":"Calculator!H21","v":""},null,null,{"$f":"Calculator!C21","v":"Employee"},{"$f":"Calculator!D21","v":""},{"$f":"Calculator!E21","v":""},{"$f":"Calculator!F21","v":""},{"$f":"Calculator!G21","v":""},{"$f":"Calculator!H21","v":""}]
[null,{"$f":"'1. Plan Inputs'!F17","v":"OAP"},null,null,null,null,null,null,null,{"$f":"'1. Plan Inputs'!I17","v":"HSA 1350"},null,null,null,null,null,null,null,{"$f":"'1. Plan Inputs'!L17","v":"HSA 2000"},null,null,null,null,null,null,null,{"$f":"'1. Plan Inputs'!O17","v":0},null,null,null,null,null,null,null,{"$f":"'1. Plan Inputs'!R17","v":0},null,null,null,null,null,null,null,{"$f":"'1. Plan Inputs'!U17","v":0}]
["Deductible",{"$f":"'1. Plan Inputs'!G23","v":250},{"$f":"B19","v":250},250,250,250,250,null,"Deductible",{"$f":"'1. Plan Inputs'!J23","v":1350},{"$f":"J19","v":1350},{"$f":"K19","v":1350},{"$f":"L19","v":1350},{"$f":"M19","v":1350},{"$f":"N19","v":1350},null,"Deductible",{"$f":"'1. Plan Inputs'!M23","v":2000},{"$f":"R19","v":2000},{"$f":"S19","v":2000},{"$f":"T19","v":2000},{"$f":"U19","v":2000},{"$f":"V19","v":2000},null,"Deductible",{"$f":"'1. Plan Inputs'!P23","v":0},{"$f":"Z19","v":0},{"$f":"AA19","v":0},{"$f":"AB19","v":0},{"$f":"AC19","v":0},{"$f":"AD19","v":0},null,"Deductible",{"$f":"'1. Plan Inputs'!S23","v":0},{"$f":"AH19","v":0},{"$f":"AI19","v":0},{"$f":"AJ19","v":0},{"$f":"AK19","v":0},{"$f":"AL19","v":0},null,"Deductible",{"$f":"'1. Plan Inputs'!V23","v":0},{"$f":"AP19","v":0},{"$f":"AQ19","v":0},{"$f":"AR19","v":0},{"$f":"AS19","v":0},{"$f":"AT19","v":0}]
["Family Deductible",{"$f":"'1. Plan Inputs'!G24","v":500},500,500,500,500,500,null,"Family Deductible",{"$f":"'1. Plan Inputs'!J24","v":2700},2700,2700,2700,2700,2700,null,"Family Deductible",{"$f":"'1. Plan Inputs'!M24","v":4000},4000,4000,4000,4000,4000,null,"Family Deductible",{"$f":"'1. Plan Inputs'!P24","v":0},0,0,0,0,0,null,"Family Deductible",{"$f":"'1. Plan Inputs'!S24","v":0},0,0,0,0,0,null,"Family Deductible",{"$f":"'1. Plan Inputs'!V24","v":0},0,0,0,0,0]
["Coinsurance",{"$f":"'1. Plan Inputs'!G28","v":0.1},0.1,0.1,0.1,0.1,0.1,null,"Coinsurance",{"$f":"'1. Plan Inputs'!J28","v":0.2},0.2,0.2,0.2,0.2,0.2,null,"Coinsurance",{"$f":"'1. Plan Inputs'!M28","v":0.2},0.2,0.2,0.2,0.2,0.2,null,"Coinsurance",{"$f":"'1. Plan Inputs'!P28","v":0},0,0,0,0,0,null,"Coinsurance",{"$f":"'1. Plan Inputs'!S28","v":0},0,0,0,0,0,null,"Coinsurance",{"$f":"'1. Plan Inputs'!V28","v":0},0,0,0,0,0]
["OOPM",{"$f":"'1. Plan Inputs'!G30","v":2500},{"$f":"B22","v":2500},{"$f":"C22","v":2500},2500,2500,2500,null,"OOPM",{"$f":"'1. Plan Inputs'!J30","v":2700},{"$f":"J22","v":2700},2700,2700,2700,2700,null,"OOPM",{"$f":"'1. Plan Inputs'!M30","v":6000},{"$f":"R22","v":6000},6000,6000,6000,6000,null,"OOPM",{"$f":"'1. Plan Inputs'!P30","v":0},{"$f":"Z22","v":0},0,0,0,0,null,"OOPM",{"$f":"'1. Plan Inputs'!S30","v":0},{"$f":"AH22","v":0},0,0,0,0,null,"OOPM",{"$f":"'1. Plan Inputs'!V30","v":0},{"$f":"AP22","v":0},0,0,0,0]
["Family OOPM",{"$f":"'1. Plan Inputs'!G31","v":5000},{"$f":"B23","v":5000},5000,5000,5000,5000,null,"Family OOPM",{"$f":"'1. Plan Inputs'!J31","v":5400},{"$f":"J23","v":5400},5400,5400,5400,5400,null,"Family OOPM",{"$f":"'1. Plan Inputs'!M31","v":12000},{"$f":"R23","v":12000},12000,12000,12000,12000,null,"Family OOPM",{"$f":"'1. Plan Inputs'!P31","v":0},{"$f":"Z23","v":0},0,0,0,0,null,"Family OOPM",{"$f":"'1. Plan Inputs'!S31","v":0},{"$f":"AH23","v":0},0,0,0,0,null,"Family OOPM",{"$f":"'1. Plan Inputs'!V31","v":0},{"$f":"AP23","v":0},0,0,0,0]
[]
["Copayment Amounts:",null,null,null,null,null,null,null,"Copayment Amounts:",null,null,null,null,null,null,null,"Copayment Amounts:",null,null,null,null,null,null,null,"Copayment Amounts:",null,null,null,null,null,null,null,"Copayment Amounts:",null,null,null,null,null,null,null,"Copayment Amounts:"]
["Preventive Copay:",{"$f":"'1. Plan Inputs'!G41","v":0},{"$f":"B26","v":0},{"$f":"C26","v":0},0,0,0,null,"Preventive Copay:",{"$f":"'1. Plan Inputs'!J41","v":0},{"$f":"J26","v":0},{"$f":"K26","v":0},{"$f":"L26","v":0},{"$f":"M26","v":0},{"$f":"N26","v":0},null,"Preventive Copay:",{"$f":"'1. Plan Inputs'!M41","v":0},{"$f":"R26","v":0},{"$f":"S26","v":0},{"$f":"T26","v":0},{"$f":"U26","v":0},{"$f":"V26","v":0},null,"Preventive Copay:",{"$f":"'1. Plan Inputs'!P41","v":0},{"$f":"Z26","v":0},{"$f":"AA26","v":0},{"$f":"AB26","v":0},{"$f":"AC26","v":0},{"$f":"AD26","v":0},null,"Preventive Copay:",{"$f":"'1. Plan Inputs'!S41","v":0},{"$f":"AH26","v":0},{"$f":"AI26","v":0},{"$f":"AJ26","v":0},{"$f":"AK26","v":0},{"$f":"AL26","v":0},null,"Preventive Copay:",{"$f":"'1. Plan Inputs'!V41","v":0},{"$f":"AP26","v":0},{"$f":"AQ26","v":0},{"$f":"AR26","v":0},{"$f":"AS26","v":0},{"$f":"AT26","v":0}]
["Inpatient Copay:",{"$f":"'1. Plan Inputs'!G34","v":0},0,{"$f":"C27","v":0},0,0,0,null,"Inpatient Copay:",{"$f":"'1. Plan Inputs'!J34","v":0},0,0,0,0,0,null,"Inpatient Copay:",{"$f":"'1. Plan Inputs'!M34","v":0},0,0,0,0,0,null,"Inpatient Copay:",{"$f":"'1. Plan Inputs'!P34","v":0},0,0,0,0,0,null,"Inpatient Copay:",{"$f":"'1. Plan Inputs'!S34","v":0},0,0,0,0,0,null,"Inpatient Copay:",{"$f":"'1. Plan Inputs'!V34","v":0},0,0,0,0,0]
["Outpatient Copay:",{"$f":"'1. Plan Inputs'!G35","v":0},0,0,0,0,0,null,"Outpatient Copay:",{"$f":"'1. Plan Inputs'!J35","v":0},0,0,0,0,0,null,"Outpatient Copay:",{"$f":"'1. Plan Inputs'!M35","v":0},0,0,0,0,0,null,"Outpatient Copay:",{"$f":"'1. Plan Inputs'!P35","v":0},0,0,0,0,0,null,"Outpatient Copay:",{"$f":"'1. Plan Inputs'!S35","v":0},0,0,0,0,0,null,"Outpatient Copay:",{"$f":"'1. Plan Inputs'!V35","v":0},0,0,0,0,0]
["Lab/X-Ray/Radiology Copay:",{"$f":"'1. Plan Inputs'!G36","v":0},0,0,0,0,0,null,"Lab/X-Ray/Radiology Copay:",{"$f":"'1. Plan Inputs'!J36","v":0},0,0,0,0,0,null,"Lab/X-Ray/Radiology Copay:",{"$f":"'1. Plan Inputs'!M36","v":0},0,0,0,0,0,null,"Lab/X-Ray/Radiology Copay:",{"$f":"'1. Plan Inputs'!P36","v":0},0,0,0,0,0,null,"Lab/X-Ray/Radiology Copay:",{"$f":"'1. Plan Inputs'!S36","v":0},0,0,0,0,0,null,"Lab/X-Ray/Radiology Copay:",{"$f":"'1. Plan Inputs'!V36","v":0},0,0,0,0,0]
["Emergency Room Copay:",{"$f":"'1. Plan Inputs'!G38","v":200},200,200,200,200,200,null,"Emergency Room Copay:",{"$f":"'1. Plan Inputs'!J38","v":0},0,0,0,0,0,null,"Emergency Room Copay:",{"$f":"'1. Plan Inputs'!M38","v":0},0,0,0,0,0,null,"Emergency Room Copay:",{"$f":"'1. Plan Inputs'!P38","v":0},0,0,0,0,0,null,"Emergency Room Copay:",{"$f":"'1. Plan Inputs'!S38","v":0},0,0,0,0,0,null,"Emergency Room Copay:",{"$f":"'1. Plan Inputs'!V38","v":0},0,0,0,0,0]
{"$rows_left_out":188}